{"text_format":"1","workbook":"xlsx","n_sheets":5,"sheets":["A WCAG Checklist Cover","B WCAG Criteria 1","C WCAG Criteria 2","D WCAG Criteria 3","E WCAG Criteria 4"],"not_rendered":{"charts":0,"images":1,"macros":1,"external_links":0,"defined_names":0,"comments":0,"pivot_tables":0},"unopened":[],"bounds":{"document_bytes":16777216,"sheet_cells":100000,"rows_first":2000,"rows_last":500,"rows_between":2000,"halvings":0,"cell_chars":16384,"cell_head_chars":4096},"cells_cut":0,"cells_raw":0,"read":"whole","date_system":"1900"}

{"sheet":"A WCAG Checklist Cover","index":0,"n_rows":28,"n_cols":7,"rows_kept":28,"cut":false,"hidden":false,"merged":[[1,0,1,5],[5,0,5,5],[9,0,9,3],[23,1,23,14],[24,1,24,14],[5,6,5,11],[6,6,6,11],[7,6,7,11],[8,6,8,11],[16,0,16,2],[17,0,17,2],[25,1,25,14],[26,1,26,14],[27,1,27,14],[3,0,3,12],[10,5,10,14],[11,5,11,14],[12,5,12,14],[13,5,13,14],[18,0,18,2],[19,0,19,2]]}
[]
["WCAG 2.1 AA Compliance Checklist"]
[]
["All websites, web applications and digital products must achieve WCAG 2.1 AA standards in order to meet CPS Policy, Governmental accessibility and Legislative requirements."]
[]
["Full details of these standards can be found here.",null,null,null,null,null,"Outcome - tick ONE (CPS ITA TEAM ONLY)"]
[null,null,null,null,null,null,"WCAG 2.1 AA Standard COMPLETELY MET"]
[null,null,null,null,null,null,"WCAG 2.1 AA Standard MET WITH ISSUES"]
[null,null,null,null,null,null,"WCAG 2.1 AA Standard NOT MET "]
["Project/ Change information"]
["Name of person completing the checklist"]
["Organisation/ Team"]
["Date of checklist completion"]
["Name of website/web application/product"]
[]
["Automated Overview",null,null,"CM","MWI","NM","NA"]
["WCAG Criteria 1",null,null,{"$f":"SUM('B WCAG Criteria 1'!B45+'B WCAG Criteria 1'!B31+'B WCAG Criteria 1'!B16+'B WCAG Criteria 1'!B5)","v":0},{"$f":"SUM('B WCAG Criteria 1'!C45+'B WCAG Criteria 1'!C31+'B WCAG Criteria 1'!C16+'B WCAG Criteria 1'!C5)","v":0},{"$f":"SUM('B WCAG Criteria 1'!D45+'B WCAG Criteria 1'!D31+'B WCAG Criteria 1'!D16+'B WCAG Criteria 1'!D5)","v":0},{"$f":"SUM('B WCAG Criteria 1'!E45+'B WCAG Criteria 1'!E31+'B WCAG Criteria 1'!E16+'B WCAG Criteria 1'!E5)","v":0}]
["WCAG Criteria 2",null,null,{"$f":"'C WCAG Criteria 2'!B5+'C WCAG Criteria 2'!B13+'C WCAG Criteria 2'!B20+'C WCAG Criteria 2'!B25+'C WCAG Criteria 2'!B38","v":0},{"$f":"'C WCAG Criteria 2'!C5+'C WCAG Criteria 2'!C13+'C WCAG Criteria 2'!C20+'C WCAG Criteria 2'!C25+'C WCAG Criteria 2'!C38","v":0},{"$f":"'C WCAG Criteria 2'!D5+'C WCAG Criteria 2'!D13+'C WCAG Criteria 2'!D20+'C WCAG Criteria 2'!D25+'C WCAG Criteria 2'!D38","v":0},{"$f":"'C WCAG Criteria 2'!E5+'C WCAG Criteria 2'!E13+'C WCAG Criteria 2'!E20+'C WCAG Criteria 2'!E25+'C WCAG Criteria 2'!E38","v":0}]
["WCAG Criteria 3",null,null,{"$f":"'D WCAG Criteria 3'!B5+'D WCAG Criteria 3'!B11+'D WCAG Criteria 3'!B19","v":0},{"$f":"'D WCAG Criteria 3'!C5+'D WCAG Criteria 3'!C11+'D WCAG Criteria 3'!C19","v":0},{"$f":"'D WCAG Criteria 3'!D5+'D WCAG Criteria 3'!D11+'D WCAG Criteria 3'!D19","v":0},{"$f":"'D WCAG Criteria 3'!E5+'D WCAG Criteria 3'!E11+'D WCAG Criteria 3'!E19","v":0}]
["WCAG Criteria 4",null,null,{"$f":"'E WCAG Criteria 4'!B5","v":0},{"$f":"'E WCAG Criteria 4'!C5","v":0},{"$f":"'E WCAG Criteria 4'!D5","v":0},{"$f":"'E WCAG Criteria 4'!E5","v":0}]
[]
["Sources of Assurance"]
["Please detail methods used to gauge WCAG 2.1 AA Compliance"]
[1]
[2]
[3]
[4]
[5]

{"sheet":"B WCAG Criteria 1","index":1,"n_rows":63,"n_cols":5,"rows_kept":63,"cut":false,"hidden":false,"merged":[[59,2,59,4],[49,0,50,0],[53,0,54,0],[55,0,56,0],[57,0,58,0],[59,0,62,0],[36,0,37,0],[40,0,41,0],[42,0,42,4],[43,0,44,0],[46,0,47,0],[0,0,0,4],[1,0,1,4],[2,0,2,4],[6,0,12,0],[32,0,34,0],[22,0,23,0],[28,0,28,4],[3,0,4,0],[14,0,15,0],[29,0,30,0],[17,0,18,0],[13,0,13,4]]}
["Criteria 1 - Perceivable"]
["Web content is made available to the senses - sight, hearing, and/or touch"]
["Guideline 1.1\nText Alternatives: Provide text alternatives for any non-text content"]
["Guideline Outcome","Completely Met","Met with issues","Not Met","Agreed Not Applicable"]
[null,{"$f":"COUNTIF($C$7:$C$13,B4)","v":0},{"$f":"COUNTIF($C$7:$C$13,C4)","v":0},{"$f":"COUNTIF($C$7:$C$13,D4)","v":0},{"$f":"COUNTIF($C$7:$C$13,E4)","v":0}]
["WCAG Section","Guidance on Meeting Standards","Confirmation of Criteria Met","Project Comments","CPS Digital Accessibility Comments"]
["1.1.1 Non-text Content\n(Level A)","Images, form image buttons, and image map hot spots have appropriate, equivalent alternative text"]
[null,"Images that do not convey content, are decorative, or contain content that is already conveyed in text are given null alt text (alt=\"\") or implemented as CSS backgrounds. All linked images have descriptive alternative text."]
[null,"Equivalent alternatives to complex images are provided in context or on a separate linked page."]
[null,"Form buttons have a descriptive value."]
[null,"Form inputs have associated text labels."]
[null,"Embedded multimedia is identified via accessible text."]
[null,"Frames and iframes are appropriately titled."]
["Guideline 1.2\nTime-based Media: Provide alternatives for time-based media"]
["Guideline Outcome","Completely Met","Met with issues","Not Met","Agreed Not Applicable"]
[null,{"$f":"COUNTIF($C$18:$C$28,B15)","v":0},{"$f":"COUNTIF($C$18:$C$28,C15)","v":0},{"$f":"COUNTIF($C$18:$C$28,D15)","v":0},{"$f":"COUNTIF($C$18:$C$28,E15)","v":0}]
["WCAG Section","Guidance on Meeting Standards","Confirmation of Criteria Met","Project Comments","CPS Digital Accessibility Comments"]
["1.2.1 Pre-recorded Audio-only and Video-only\n(Level A)","A transcript of relevant content is provided for non-live audio-only (audio podcasts, MP3 files, etc.)."]
[null,"A transcript or audio description of relevant content is provided for non-live video-only, unless the video is decorative."]
["1.2.2 Captions (Pre-recorded)\n(Level A)","Synchronized captions are provided for non-live video (YouTube videos, etc.)."]
["1.2.3 Audio Description or Media Alternative (Pre-recorded)\n(Level A)","A transcript or audio description is provided for non-live video. NOTE: Only required if there is relevant visual content that is not presented in the audio."]
["1.2.4 Captions (Live)\n(Level AA)","Synchronized captions are provided for live media that contains audio (audio-only broadcasts, web casts, video conferences, etc.)"]
["1.2.5 Audio Description (Pre-recorded)\n(Level AA)","Audio descriptions are provided for non-live video. NOTE: Only required if there is relevant visual content that is not presented in the audio."]
[null,"While not required at Level AA, for optimal accessibility WebAIM recommends transcripts in addition to audio descriptions."]
["1.2.6 Sign Language (Pre-recorded)\n(Level AAA)","A sign language video is provided for media that contains audio."]
["1.2.7 Extended Audio Description (Pre-recorded)\n(Level AAA)","When audio description cannot be added to video due to audio timing (e.g., insufficient pauses in the audio), an alternative version of the video with pauses that allow audio descriptions is provided."]
["1.2.8 Media Alternative (Pre-recorded)\n(Level AAA)","A transcript is provided for pre-recorded media that has a video track. For optimal accessibility, WebAIM strongly recommends transcripts for all multimedia."]
["1.2.9 Audio-only (Live)\n(Level AAA)","A descriptive text transcript (e.g., the script of the live audio) is provided for live content that has audio."]
["Guideline 1.3\nAdaptable: Create content that can be presented in different ways (for example simpler layout) without losing information or structure"]
["Guideline Outcome","Completely Met","Met with issues","Not Met","Agreed Not Applicable"]
[null,{"$f":"COUNTIF($C$33:$C$42,B30)","v":0},{"$f":"COUNTIF($C$33:$C$42,C30)","v":0},{"$f":"COUNTIF($C$33:$C$42,D30)","v":0},{"$f":"COUNTIF($C$33:$C$42,E30)","v":0}]
["WCAG Section","Guidance on Meeting Standards","Confirmation of Criteria Met","Project Comments","CPS Digital Accessibility Comments"]
["1.3.1 Info and Relationships\n(Level A)","Semantic mark-up is used to designate headings (<h1>), regions/landmarks, lists (<ul>, <ol>, and <dl>), emphasized or special text (<strong>, <code>, <abbr>, <blockquote>, for example), etc. Semantic mark-up is used appropriately.",null,null,"Additional guidance on Semantic Mark-ups\n•\thttps://webaim.org/techniques/semanticstructure/\n•\thttps://www.w3.org/WAI/WCAG21/Techniques/html/H49\n•\thttps://learn-the-web.algonquindesign.ca/topics/html-semantics-cheat-sheet/"]
[null,"Tables are used for tabular data and data cells are associated with their headers. Data table captions, if present, are associated to data tables."]
[null,"Text labels are associated with form input elements. Related form elements are grouped with fieldset/legend. ARIA labelling may be used when standard HTML is insufficient."]
["1.3.2 Meaningful Sequence\n(Level A)","The reading and navigation order (determined by code order) is logical and intuitive."]
["1.3.3 Sensory Characteristics\n(Level A)","Instructions do not rely upon shape, size, or visual location (e.g., \"Click the square icon to continue\" or \"Instructions are in the right-hand column\")."]
[null,"Instructions do not rely upon sound (e.g., \"A beeping sound indicates you may continue.\")."]
["1.3.4 Orientation\n(Level AA)","Orientation of web content is not restricted to only portrait or landscape, unless a specific orientation is necessary."]
["1.3.5 Identify Input Purpose\n(Level AA)","Input fields that collect certain types of user information have an appropriate autocomplete attribute defined."]
{"$rows_left_out":24}
{"sheet":"C WCAG Criteria 2","index":2,"n_rows":43,"n_cols":5,"rows_kept":43,"cut":false,"hidden":false,"merged":[[36,0,37,0],[30,0,31,0],[0,0,0,4],[1,0,1,4],[2,0,2,4],[3,0,4,0],[35,0,35,4],[6,0,7,0],[10,0,10,4],[11,0,12,0],[15,0,16,0],[17,0,17,4],[18,0,19,0],[22,0,22,4],[23,0,24,0],[26,0,27,0]]}
["Criteria 2 - Operable"]
["Interface forms, controls, and navigation are operable"]
["Guideline 2.1\nKeyboard Accessible: Make all functionality available from a keyboard"]
["Guideline Outcome","Completely Met","Met with issues","Not Met","Agreed Not Applicable"]
[null,{"$f":"COUNTIF('C WCAG Criteria 2'!A7:A8:$C$10,B4)","v":0},{"$f":"COUNTIF($C$7:$C$10,C4)","v":0},{"$f":"COUNTIF($C$7:$C$10,D4)","v":0},{"$f":"COUNTIF($C$7:$C$10,E4)","v":0}]
["WCAG Section","Guidance on Meeting Standards","Confirmation of Criteria Met","Project Comments","CPS Digital Accessibility Comments"]
["2.1.1 Keyboard\n(Level A)","All page functionality is available using the keyboard, unless the functionality cannot be accomplished in any known way using a keyboard (e.g., free hand drawing).",null,null,"Tool tip\nUsing TAB/Arrow keys to access elements; Enter or spacebar to invoke the elements"]
[null,"Page-specified shortcut keys and access keys (access key should typically be avoided) do not conflict with existing browser and screen reader shortcuts."]
["2.1.2 No Keyboard Trap\n(Level A)","Keyboard focus is never locked or trapped at one particular page element. The user can navigate to and from all navigable page elements using only a keyboard.",null,null,"Tool tip https://www.w3.org/TR/UNDERSTANDING-WCAG20/keyboard-operation-trapping.html"]
["2.1.4 Character Key Shortcuts\n(Level A)","If a keyboard shortcut uses printable character keys, then the user must be able to disable the key command, change the defined key to a non-printable key (Ctrl, Alt, etc.), or only activate the shortcut when an associated interface component or button is focused."]
["Guideline 2.2\nEnough Time: Provide users enough time to read and use content"]
["Guideline Outcome","Completely Met","Met with issues","Not Met","Agreed Not Applicable"]
[null,{"$f":"COUNTIF($C$15:$C$17,B12)","v":0},{"$f":"COUNTIF($C$15:$C$17,C12)","v":0},{"$f":"COUNTIF($C$15:$C$17,D12)","v":0},{"$f":"COUNTIF($C$15:$C$17,E12)","v":0}]
["WCAG Section","Guidance on Meeting Standards","Confirmation of Criteria Met","Project Comments","CPS Digital Accessibility Comments"]
["2.2.1 Timing Adjustable\n(Level A)","If a page or application has a time limit, the user is given options to turn off, adjust, or extend that time limit. This is not a requirement for real-time events (e.g., an auction), where the time limit is absolutely required, or if the time limit is longer than 20 hours."]
["2.2.2 Pause, Stop, Hide\n(Level A)","Automatically moving, blinking, or scrolling content (such as carousels, marquees, or animations) that lasts longer than 5 seconds can be paused, stopped, or hidden by the user."]
[null,"Automatically updating content (e.g., a dynamically-updating news ticker, chat messages, etc.) can be paused, stopped, or hidden by the user or the user can manually control the timing of the updates."]
["Guideline 2.3\nSeizures and Physical Reactions: Do not design content in a way that is known to cause seizures or physical reactions."]
["Guideline Outcome","Completely Met","Met with issues","Not Met","Agreed Not Applicable"]
[null,{"$f":"COUNTIF($C$22:$C$22,B19)","v":0},{"$f":"COUNTIF($C$22:$C$22,C19)","v":0},{"$f":"COUNTIF($C$22:$C$22,D19)","v":0},{"$f":"COUNTIF($C$22:$C$22,E19)","v":0}]
["WCAG Section","Guidance on Meeting Standards","Confirmation of Criteria Met","Project Comments","CPS Digital Accessibility Comments"]
["2.3.1 Three Flashes or Below Threshold\n(Level A)","No page content flashes more than 3 times per second unless that flashing content is sufficiently small and the flashes are of low contrast and do not contain too much red. (See general flash and red flash thresholds)",null,null,"See general flash and red flash thresholds\nhttps://www.w3.org/TR/WCAG21/#dfn-general-flash-and-red-flash-thresholds"]
["Guideline 2.4\nNavigable: Provide ways to help users navigate, find content, and determine where they are."]
["Guideline Outcome","Completely Met","Met with issues","Not Met","Agreed Not Applicable"]
[null,{"$f":"COUNTIF($C$27:$C$35,B24)","v":0},{"$f":"COUNTIF($C$27:$C$35,C24)","v":0},{"$f":"COUNTIF($C$27:$C$35,D24)","v":0},{"$f":"COUNTIF($C$27:$C$35,E24)","v":0}]
["WCAG Section","Guidance on Meeting Standards","Confirmation of Criteria Met","Project Comments","CPS Digital Accessibility Comments"]
["2.4.1 Bypass Blocks\n(Level A)","A link is provided to skip navigation and other page elements that are repeated across web pages."]
[null,"A proper heading structure and/or identification of page regions/landmarks may be considered a sufficient technique. Because navigating by headings or regions is not supported in most browsers, WebAIM recommends a \"skip\" link (in addition to headings and regions) to best support sighted keyboard users."]
["2.4.2 Page Titled\n(Level A)","The web page has a descriptive and informative page title."]
["2.4.3 Focus Order\n(Level A)","The navigation order of links, form elements, etc. is logical and intuitive.",null,null,"Tool tip\nTAB through the elements to check order"]
["2.4.4 Link Purpose (In Context)\n(Level A)","The purpose of each link (or form image button or image map hotspot) can be determined from the link text alone, or from the link text and its context (e.g., surrounding text, list item, previous heading, or table headers)."]
[null,"Links (or form image buttons) with the same text that go to different locations are readily distinguishable."]
["2.4.5 Multiple Ways\n(Level AA)","Multiple ways are available to find other web pages on the site - at least two of: a list of related pages, table of contents, site map, site search, or list of all available web pages."]
["2.4.6 Headings and Labels\n(Level AA)","Page headings and labels for form and interactive controls are informative. Avoid duplicating heading (e.g., \"More Details\") or label text (e.g., \"First Name\") unless the structure provides adequate differentiation between them."]
["2.4.7 Focus Visible\n(Level AA)","It is visually apparent which page element has the current keyboard focus (i.e., as you tab through the page, you can see where you are)."]
["Guideline 2.5\nInput Modalities: Make it easier for users to operate functionality through various inputs beyond keyboard."]
["Guideline Outcome","Completely Met","Met with issues","Not Met","Agreed Not Applicable"]
[null,{"$f":"COUNTIF($C$40:$C$43,B37)","v":0},{"$f":"COUNTIF($C$40:$C$43,C37)","v":0},{"$f":"COUNTIF($C$40:$C$43,D37)","v":0},{"$f":"COUNTIF($C$40:$C$43,E37)","v":0}]
["WCAG Section","Guidance on Meeting Standards","Confirmation of Criteria Met","Project Comments","CPS Digital Accessibility Comments"]
["2.5.1 Pointer Gestures\n(Level A)","If multipoint or path-based gestures (such as pinching, swiping, or dragging across the screen) are not essential to the functionality, then the functionality can also be performed with a single point activation (such as activating a button)."]
{"$rows_left_out":4}
{"sheet":"D WCAG Criteria 3","index":3,"n_rows":25,"n_cols":5,"rows_kept":25,"cut":false,"hidden":false,"merged":[[9,0,10,0],[16,0,16,4],[17,0,18,0],[20,0,21,0],[0,0,0,4],[1,0,1,4],[2,0,2,4],[3,0,4,0],[8,0,8,4]]}
["Criteria 3 - Understandable"]
["Information and the operation of user interface must be understandable."]
["Guideline 3.1\nReadable: Make text content readable and understandable"]
["Guideline Outcome","Completely Met","Met with issues","Not Met","Agreed Not Applicable"]
[null,{"$f":"COUNTIF($C$7:$C$8,B4)","v":0},{"$f":"COUNTIF($C$7:$C$8,C4)","v":0},{"$f":"COUNTIF($C$7:$C$8,D4)","v":0},{"$f":"COUNTIF($C$7:$C$8,E4)","v":0}]
["WCAG Section","Guidance on Meeting Standards","Confirmation of Criteria Met","Project Comments","CPS Digital Accessibility Comments"]
["3.1.1 Language of Page\n(Level A)","The language of the page is identified using the HTML lang attribute (e.g., <html lang=\"en\">)."]
["3.1.2 Language of Parts\n(Level AA)","The language of page content that is in a different language is identified using the lang attribute (e.g., <blockquote lang=\"es\">)."]
["Guideline 3.2\nPredictable: Make Web pages appear and operate in predictable ways"]
["Guideline Outcome","Completely Met","Met with issues","Not Met","Agreed Not Applicable"]
[null,{"$f":"COUNTIF($C$13:$C$16,B10)","v":0},{"$f":"COUNTIF($C$13:$C$16,C10)","v":0},{"$f":"COUNTIF($C$13:$C$16,D10)","v":0},{"$f":"COUNTIF($C$13:$C$16,E10)","v":0}]
["WCAG Section","Guidance on Meeting Standards","Confirmation of Criteria Met","Project Comments","CPS Digital Accessibility Comments"]
["3.2.1 On Focus\n(Level A)","When a page element receives focus, it does not result in a substantial change to the page, the spawning of a pop-up window, an additional change of keyboard focus, or any other change that could confuse or disorient the user."]
["3.2.2 On Input\n(Level A)","When a user inputs information or interacts with a control, it does not result in a substantial change to the page, the spawning of a pop-up window, an additional change of keyboard focus, or any other change that could confuse or disorient the user unless the user is informed of the change ahead of time."]
["3.2.3 Consistent Navigation\n(Level AA)","Navigation links that are repeated on web pages do not change order when navigating through the site."]
["3.2.4 Consistent Identification\n(Level AA)","Elements that have the same functionality across multiple web pages are consistently identified. For example, a search box at the top of the site should always be labelled the same way."]
["Guideline 3.3\nInput Assistance: Help users avoid and correct mistakes"]
["Guideline Outcome","Completely Met","Met with issues","Not Met","Agreed Not Applicable"]
[null,{"$f":"COUNTIF($C$21:$C$25,B18)","v":0},{"$f":"COUNTIF($C$13:$C$16,C18)","v":0},{"$f":"COUNTIF($C$13:$C$16,D18)","v":0},{"$f":"COUNTIF($C$13:$C$16,E18)","v":0}]
["WCAG Section","Guidance on Meeting Standards","Confirmation of Criteria Met","Project Comments","CPS Digital Accessibility Comments"]
["3.3.1 Error Identification\n(Level A)","Required form elements or form elements that require a specific format, value, or length provide this information within the element's label."]
[null,"Form validation errors are efficient, intuitive, and accessible. The error is clearly identified, quick access to the problematic element is provided, and the user can easily fix the error and resubmit the form.",null,null,"Tool tip\nAre alert messages read out?"]
["3.3.2 Labels or Instructions\n(Level A)","Sufficient labels, cues, and instructions for required interactive elements are provided via instructions, examples, properly positioned form labels, and/or fieldsets/legends.",null,null,"Tool tip\nTag element/functionality to read out instructions"]
["3.3.3 Error Suggestion\n(Level AA)","If an input error is detected (via client-side or server-side validation), suggestions are provided for fixing the input in a timely and accessible manner.",null,null,"Tool tip\nAlert messages to be read out"]
["3.3.4 Error Prevention (Legal, Financial, Data)\n(Level AA)","If the user can change or delete legal, financial, or test data, the changes/deletions can be reversed, verified, or confirmed."]

{"sheet":"E WCAG Criteria 4","index":4,"n_rows":10,"n_cols":5,"rows_kept":10,"cut":false,"hidden":false,"merged":[[7,0,8,0],[0,0,0,4],[1,0,1,4],[2,0,2,4],[3,0,4,0]]}
["Criteria 4 - Robust"]
["Content must be robust enough that it can be interpreted by a wide variety of user agents, including assistive technologies"]
["Guideline 4.1\nCompatible: Maximize compatibility with current and future user agents, including assistive technologies"]
["Guideline Outcome","Completely Met","Met with issues","Not Met","Agreed Not Applicable"]
[null,{"$f":"COUNTIF($C$7:$C$10,B4)","v":0},{"$f":"COUNTIF($C$7:$C$10,C4)","v":0},{"$f":"COUNTIF($C$7:$C$10,D4)","v":0},{"$f":"COUNTIF($C$7:$C$10,E4)","v":0}]
["WCAG Section","Guidance on Meeting Standards","Confirmation of Criteria Met","Project Comments","CPS Digital Accessibility Comments"]
["4.1.1 Parsing\n(Level A)","Significant HTML/XHTML validation/parsing errors are avoided. Check at http://validator.w3.org/",null,null,"Tool tip\nCheck at http://validator.w3.org/"]
["4.1.2 Name, Role, Value\n(Level A)","Mark-up is used in a way that facilitates accessibility. This includes following the HTML/XHTML specifications and using forms, form labels, frame titles, etc. appropriately."]
[null,"ARIA is used appropriately to enhance accessibility when HTML is not sufficient."]
["4.1.3 Status Messages\n(Level AA)","If an important status message is presented and focus is not set to that message, the message must be announced to screen reader users, typically via an ARIA alert or live region."]